{"text_format":"1","workbook":"xlsx","n_sheets":2,"sheets":["Curtailment Record","Event Summary"],"not_rendered":{"charts":3,"images":2,"macros":1,"external_links":0,"defined_names":2,"comments":0,"pivot_tables":0},"unopened":[],"bounds":{"document_bytes":16777216,"sheet_cells":100000,"rows_first":2000,"rows_last":500,"rows_between":2000,"halvings":0,"cell_chars":16384,"cell_head_chars":4096},"cells_cut":0,"cells_raw":0,"read":"whole","date_system":"1900"}

{"sheet":"Curtailment Record","index":0,"n_rows":3007,"n_cols":24,"rows_kept":3007,"cut":false,"hidden":false,"merged":[[0,8,0,9]]}
["Maximum of 3000 Curtailment Entries",null,null,null,"Curtailment Records",null,null,null,null,null,"Warning: Cannot Undo a Clear"]
["2015 Base with new conservation but no purchase ahead"]
["Event Hour Mapping","Event","Event Hour counter","Event-Hour Counter mapping","Sim","Month","Day","Hour","Curt","Rviol","Wat Yr","Temp Yr","Wind Yr","Load","Rreq","Arsrv","Thr","Purc","Hydro","Wind","FO MW","Per FO","WCF","Sliceacc"]
[{"$f":"CONCATENATE(B4,\"_\",H4)","v":"1_16"},1,1,{"$f":"CONCATENATE(B4,\"_\",C4)","v":"1_1"},1,10,14,16,0.7,0,1929,1929,16,26055,1553,0,11699,0,14689,28,1794,0.1,8.9999999999999993E-3]
[{"$f":"CONCATENATE(B5,\"_\",H5)","v":"1_17"},{"$f":"IF(E5=E4,    (IF(F5=F4,    (IF(G5=G4,   (IF(H5=H4+1,B4,B4+1)), (IF(AND(G5=G4+1,H5=1,H4=24),B4,B4+1)))), B4+1)), B4+1)","v":1},{"$f":"IF(B5=B4,C4+1,1)","v":2},{"$f":"CONCATENATE(B5,\"_\",C5)","v":"1_2"},1,10,14,17,262.39999999999998,0,1929,1929,16,26213,1568,0,11437,0,15344,55,2056,0.114,1.7999999999999999E-2]
["1_18",{"$f":"IF(E6=E5,    (IF(F6=F5,    (IF(G6=G5,   (IF(H6=H5+1,B5,B5+1)), (IF(AND(G6=G5+1,H6=1,H5=24),B5,B5+1)))), B5+1)), B5+1)","v":1},{"$f":"IF(B6=B5,C5+1,1)","v":3},{"$f":"CONCATENATE(B6,\"_\",C6)","v":"1_3"},1,10,14,18,369.5,0,1929,1929,16,26024,1550,0,11330,0,15148,62,2163,0.12,0.02]
["1_19",1,4,"1_4",1,10,14,19,494.8,0,1929,1929,16,25382,1511,0,11204,0,14528,41,2288,0.127,1.2999999999999999E-2]
["1_20",1,5,"1_5",1,10,14,20,458.4,0,1929,1929,16,24835,1485,0,11241,0,13957,64,2252,0.125,2.1000000000000001E-2]
["1_21",1,6,"1_6",1,10,14,21,458.4,0,1929,1929,16,24817,1481,0,11241,0,13887,116,2252,0.125,3.7999999999999999E-2]
["1_22",1,7,"1_7",1,10,14,22,458.4,0,1929,1929,16,24426,1438,0,11241,0,13019,54,2252,0.125,1.7000000000000001E-2]
["1_23",1,8,"1_8",1,10,14,23,406.7,0,1929,1929,16,22520,1294,0,11241,0,10140,28,2252,0.125,8.9999999999999993E-3]
["1_24",1,9,"1_9",1,10,14,24,406.7,0,1929,1929,16,20440,1192,0,11241,0,8096,-8,2252,0.125,-2E-3]
["2_9",2,1,"2_1",3,11,3,9,163.6,0,1931,1931,6,23043,1423,0,11905,0,11796,194,1578,8.7999999999999995E-2,6.3E-2]
["2_10",2,2,"2_2",3,11,3,10,488,0,1931,1931,6,24096,1448,0,11581,0,12745,297,1902,0.106,9.6000000000000002E-2]
["2_11",2,3,"2_3",3,11,3,11,67.5,0,1931,1931,6,24790,1515,0,12002,0,13502,234,1482,8.2000000000000003E-2,7.5999999999999998E-2]
["3_11",3,1,"3_1",3,11,6,11,97.5,0,1931,1931,6,25873,1528,0,11858,0,13950,983,1625,0.09,0.317]
["3_12",3,2,"3_2",3,11,6,12,97.5,0,1931,1931,6,26300,1521,0,11858,0,13826,994,1625,0.09,0.32100000000000001]
["3_13",3,3,"3_3",3,11,6,13,97.5,0,1931,1931,6,26611,1498,0,11858,0,13363,958,1625,0.09,0.309]
["3_14",3,4,"3_4",3,11,6,14,97.5,0,1931,1931,6,26818,1495,0,11858,0,13304,1223,1625,0.09,0.39500000000000002]
["3_15",3,5,"3_5",3,11,6,15,97.5,0,1931,1931,6,26951,1504,0,11858,0,13482,1178,1625,0.09,0.38]
["4_20",4,1,"4_1",3,11,18,20,92.4,0,1931,1931,6,25528,1522,0,12772,0,12564,1115,711,0.04,0.36]
["4_21",4,2,"4_2",3,11,18,21,92.4,0,1931,1931,6,25254,1501,0,12772,0,12138,1267,711,0.04,0.40899999999999997]
["4_22",4,3,"4_3",3,11,18,22,92.3,0,1931,1931,6,24246,1418,0,12772,0,10474,1384,711,0.04,0.44700000000000001]
["4_23",4,4,"4_4",3,11,18,23,93.4,0,1931,1931,6,22184,1261,0,12772,0,7341,1399,711,0.04,0.45200000000000001]
["5_23",5,1,"5_1",4,3,10,23,194.4,0,1932,1932,5,31414,2850,0,13873,3000,12783,738,2136,0.104,0.23799999999999999]
["6_10",6,1,"6_1",6,11,10,10,309.8,0,1934,1934,38,23061,1412,0,11586,0,12028,153,1897,0.106,4.9000000000000002E-2]
["6_11",6,2,"6_2",6,11,10,11,381.6,0,1934,1934,38,23679,1438,0,11514,0,12645,154,1969,0.109,0.05]
["6_12",6,3,"6_3",6,11,10,12,381.6,0,1934,1934,38,24041,1432,0,11514,0,12520,101,1969,0.109,3.3000000000000002E-2]
["6_13",6,4,"6_4",6,11,10,13,381.6,0,1934,1934,38,24298,1408,0,11514,0,12043,24,1969,0.109,8.0000000000000002E-3]
["6_14",6,5,"6_5",6,11,10,14,342.6,0,1934,1934,38,24468,1421,0,11553,0,12243,-6,1930,0.107,-2E-3]
["6_15",6,6,"6_6",6,11,10,15,55.8,0,1934,1934,38,24572,1446,0,11840,0,12352,-10,1643,9.0999999999999998E-2,-3.0000000000000001E-3]
["7_7",7,1,"7_1",6,11,12,7,765.8,0,1934,1934,38,20703,1260,0,11454,0,9163,336,2030,0.113,0.108]
["7_8",7,2,"7_2",6,11,12,8,758.1,0,1934,1934,38,22280,1344,0,11461,0,10829,248,2022,0.112,0.08]
["7_9",7,3,"7_3",6,11,12,9,758.1,0,1934,1934,38,23620,1390,0,11461,0,11758,658,2022,0.112,0.21299999999999999]
["7_10",7,4,"7_4",6,11,12,10,758.1,0,1934,1934,38,24601,1443,0,11461,0,12807,590,2022,0.112,0.19]
["7_11",7,5,"7_5",6,11,12,11,758.1,0,1934,1934,38,25242,1493,0,11461,0,13810,228,2022,0.112,7.3999999999999996E-2]
["7_12",7,6,"7_6",6,11,12,12,758.1,0,1934,1934,38,25616,1496,0,11461,0,13876,-3,2022,0.112,-1E-3]
["7_13",7,7,"7_7",6,11,12,13,758.1,0,1934,1934,38,25879,1469,0,11461,0,13335,-10,2022,0.112,-3.0000000000000001E-3]
["7_14",7,8,"7_8",6,11,12,14,758.1,0,1934,1934,38,26054,1478,0,11461,0,13516,-16,2022,0.112,-5.0000000000000001E-3]
["7_15",7,9,"7_9",6,11,12,15,758.1,0,1934,1934,38,26162,1483,0,11461,0,13611,-3,2022,0.112,-1E-3]
["7_16",7,10,"7_10",6,11,12,16,758.1,0,1934,1934,38,26238,1525,0,11461,0,14461,49,2022,0.112,1.6E-2]
["7_17",7,11,"7_11",6,11,12,17,758.1,0,1934,1934,38,26309,1546,0,11461,0,14877,228,2022,0.112,7.3999999999999996E-2]
["7_18",7,12,"7_12",6,11,12,18,758.1,0,1934,1934,38,26185,1527,0,11461,0,14496,485,2022,0.112,0.157]
["7_19",7,13,"7_13",6,11,12,19,744,0,1934,1934,38,25939,1504,0,11475,0,14012,723,2008,0.112,0.23400000000000001]
["7_20",7,14,"7_14",6,11,12,20,726.8,0,1934,1934,38,25659,1491,0,11493,0,13735,720,1991,0.111,0.23300000000000001]
["7_21",7,15,"7_15",6,11,12,21,726.8,0,1934,1934,38,25429,1482,0,11493,0,13548,678,1991,0.111,0.219]
["7_22",7,16,"7_16",6,11,12,22,726.8,0,1934,1934,38,24526,1409,0,11493,0,12098,684,1991,0.111,0.221]
["7_23",7,17,"7_17",6,11,12,23,727.8,0,1934,1934,38,22462,1252,0,11493,0,8952,710,1991,0.111,0.22900000000000001]
["7_24",7,18,"7_18",6,11,12,24,727.9,0,1934,1934,38,20470,1152,0,11493,0,6957,714,1991,0.111,0.23]
["8_9",8,1,"8_1",6,11,29,9,12.9,0,1934,1934,38,21634,1300,0,12642,0,8294,350,841,4.7E-2,0.113]
["8_10",8,2,"8_2",6,11,29,10,12.9,0,1934,1934,38,22132,1332,0,12642,0,8936,206,841,4.7E-2,6.7000000000000004E-2]
["8_11",8,3,"8_3",6,11,29,11,12.9,0,1934,1934,38,22464,1352,0,12642,0,9342,132,841,4.7E-2,4.2999999999999997E-2]
["8_12",8,4,"8_4",6,11,29,12,12.9,0,1934,1934,38,22631,1366,0,12642,0,9623,18,841,4.7E-2,6.0000000000000001E-3]
["8_13",{"$f":"IF(E54=E53,    (IF(F54=F53,    (IF(G54=G53,   (IF(H54=H53+1,B53,B53+1)), (IF(AND(G54=G53+1,H54=1,H53=24),B53,B53+1)))), B53+1)), B53+1)","v":8},5,"8_5",6,11,29,13,12.9,0,1934,1934,38,22765,1373,0,12642,0,9755,20,841,4.7E-2,6.0000000000000001E-3]
["8_14",{"$f":"IF(E55=E54,    (IF(F55=F54,    (IF(G55=G54,   (IF(H55=H54+1,B54,B54+1)), (IF(AND(G55=G54+1,H55=1,H54=24),B54,B54+1)))), B54+1)), B54+1)","v":8},6,"8_6",6,11,29,14,12.9,0,1934,1934,38,22861,1378,0,12642,0,9851,20,841,4.7E-2,6.0000000000000001E-3]
["8_15",8,7,"8_7",6,11,29,15,12.9,0,1934,1934,38,22890,1378,0,12642,0,9859,41,841,4.7E-2,1.2999999999999999E-2]
["8_16",8,8,"8_8",6,11,29,16,12.9,0,1934,1934,38,22888,1379,0,12642,0,9883,15,841,4.7E-2,5.0000000000000001E-3]
["9_2",9,1,"9_1",8,4,8,2,79.400000000000006,0,1936,1936,20,27241,2850,0,15197,3000,7755,253,822,0.04,8.2000000000000003E-2]
["9_3",9,2,"9_2",8,4,8,3,79.400000000000006,0,1936,1936,20,27088,2850,0,15197,3000,7652,203,822,0.04,6.5000000000000002E-2]
["9_4",9,3,"9_3",8,4,8,4,79.400000000000006,0,1936,1936,20,27379,2850,0,15197,3000,7608,538,822,0.04,0.17399999999999999]
["9_5",9,4,"9_4",8,4,8,5,79.400000000000006,0,1936,1936,20,28402,2850,0,15197,3000,7740,1429,822,0.04,0.46100000000000002]
["9_6",9,5,"9_5",8,4,8,6,79.400000000000006,0,1936,1936,20,30952,2850,0,15197,3000,10087,1632,822,0.04,0.52700000000000002]
["9_7",9,6,"9_6",8,4,8,7,146.4,0,1936,1936,20,34847,2850,0,15197,3000,15066,1465,822,0.04,0.47299999999999998]
["9_8",9,7,"9_7",8,4,8,8,146.4,0,1936,1936,20,37326,2850,0,15197,3000,17258,1751,822,0.04,0.56499999999999995]
["9_9",9,8,"9_8",8,4,8,9,146.4,0,1936,1936,20,37696,2850,0,15197,3000,17507,1872,822,0.04,0.60399999999999998]
["9_10",9,9,"9_9",8,4,8,10,146.4,0,1936,1936,20,37378,2850,0,15197,3000,17255,1807,822,0.04,0.58299999999999996]
["9_11",9,10,"9_10",8,4,8,11,146.4,0,1936,1936,20,36749,2850,0,15197,3000,16460,1973,822,0.04,0.63700000000000001]
["9_12",9,11,"9_11",8,4,8,12,146.4,0,1936,1936,20,35853,2850,0,15197,3000,15044,1953,822,0.04,0.63]
[{"$f":"CONCATENATE(B69,\"_\",H69)","v":"9_13"},9,12,"9_12",8,4,8,13,146.4,0,1936,1936,20,35051,2850,0,15197,3000,13422,1963,822,0.04,0.63400000000000001]
["9_14",{"$f":"IF(E70=E69,    (IF(F70=F69,    (IF(G70=G69,   (IF(H70=H69+1,B69,B69+1)), (IF(AND(G70=G69+1,H70=1,H69=24),B69,B69+1)))), B69+1)), B69+1)","v":9},{"$f":"IF(B70=B69,C69+1,1)","v":13},{"$f":"CONCATENATE(B70,\"_\",C70)","v":"9_13"},8,4,8,14,146.4,0,1936,1936,20,34348,2850,0,15197,3000,12378,2304,822,0.04,0.74399999999999999]
["9_15",9,14,"9_14",8,4,8,15,146.4,0,1936,1936,20,33907,2850,0,15197,3000,12073,2168,822,0.04,0.7]
["10_8",10,1,"10_1",9,10,15,8,30.3,0,1937,1937,31,22424,1420,0,12804,0,10476,-1,688,3.7999999999999999E-2,0]
["10_9",10,2,"10_2",9,10,15,9,30.3,0,1937,1937,31,23928,1493,0,12804,0,11937,42,688,3.7999999999999999E-2,1.4E-2]
["10_10",10,3,"10_3",9,10,15,10,30.3,0,1937,1937,31,25040,1550,0,12804,0,13067,24,688,3.7999999999999999E-2,8.0000000000000002E-3]
["10_11",10,4,"10_4",9,10,15,11,30.3,0,1937,1937,31,25770,1587,0,12804,0,13814,7,688,3.7999999999999999E-2,2E-3]
["10_12",10,5,"10_5",9,10,15,12,30.3,0,1937,1937,31,26185,1581,0,12804,0,13684,12,688,3.7999999999999999E-2,4.0000000000000001E-3]
["10_13",10,6,"10_6",9,10,15,13,30.3,0,1937,1937,31,26455,1553,0,12804,0,13138,17,688,3.7999999999999999E-2,6.0000000000000001E-3]
["10_14",10,7,"10_7",9,10,15,14,30.3,0,1937,1937,31,26611,1560,0,12804,0,13267,44,688,3.7999999999999999E-2,1.4999999999999999E-2]
["10_15",10,8,"10_8",9,10,15,15,30.3,0,1937,1937,31,26707,1565,0,12804,0,13381,26,688,3.7999999999999999E-2,8.9999999999999993E-3]
["10_16",10,9,"10_9",9,10,15,16,30.3,0,1937,1937,31,26802,1609,0,12804,0,14246,82,688,3.7999999999999999E-2,2.7E-2]
{"$rows_left_out":2928}
{"sheet":"Event Summary","index":1,"n_rows":330,"n_cols":29,"rows_kept":330,"cut":false,"hidden":false,"merged":[[4,11,4,14],[1,20,1,23]]}
["Curtailment Event Summary",null,null,null,null,null,null,null,null,null,null,null,null,null,null,{"$f":"A2","v":"2015 Base with new conservation but no purchase ahead"},null,null,null,null,null,null,null,null,null,"Wind Capacity",null,3098,"<< Input"]
[{"$f":"'Curtailment Record'!A2","v":"2015 Base with new conservation but no purchase ahead"},null,null,null,null,null,null,null,null,null,null,null,null,null,null,null,null,null,null,null,"Percent of Range"]
[null,null,null,null,null,null,null,null,null,null,null,null,null,null," ","Event","Dur","Mag","Avg Mag","Peak","Hyd","Temp","Thr","Wind","Load","Hydro","Therm","Month","Game"]
[null,null,null,"Dur","Mag","Peak","ROff","Hyd","Event","Temp","FOut","Dem","Hydro","Therm","Wind",1,{"$f":"LOOKUP(P4,A6:A400,D6:D400)","v":9},{"$f":"LOOKUP(P4,A6:A400,E6:E400)","v":3316},{"$f":"R4/Q4","v":368.44444444444446},{"$f":"LOOKUP(P4,A6:A400,F6:F400)","v":495},{"$f":"100-LOOKUP(P4,A6:A400,H6:H400)","v":17},{"$f":"LOOKUP(P4,A6:A400,J6:J400)","v":51},{"$f":"100-LOOKUP(P4,A6:A400,K6:K400)*100","v":88},{"$f":"LOOKUP(P4,A6:A400,O6:O400)*100/$AB$1","v":1.5816655907036798},{"$f":"LOOKUP(P4,A6:A400,L6:L400)","v":24524},{"$f":"LOOKUP(P4,A6:A400,M6:M400)","v":13201},{"$f":"LOOKUP(P4,A6:A400,N6:N400)","v":11319},{"$f":"LOOKUP(P4,A6:A400,C6:C400)","v":"Jul"},{"$f":"LOOKUP(P4,A6:A400,B6:B400)","v":1}]
["No","Game","Mon","hours","mw-hrs","mw-hrs","maf","(%)","Temp","(%)","(%)","(averaged over the event)"]
[1,1,"Jul",9,3316,495,10.5,83,69,51,0.12,24524,13201,11319,49]
[2,3,"Aug",3,719,488,6.1,94,69,59,0.09,23976,12681,11829,242,null,null,null,null,null,null,null,null,null,null,null,null,null,"Cycle"]
[3,3,"Aug",5,488,98,6.1,94,63.3,14,0.09,26511,13585,11858,1067,null,null,null,null,null,null,null,null,null,null,null,null,null,"Thru"]
[4,3,"Aug",4,370,93,6.1,94,69.099999999999994,64,0.04,24303,10629,12772,1291,null,null,null,null,null,null,null,null,null,null,null,null,null,"Events"]
[5,4,"Dec",1,194,194,3.4,97,16.399999999999999,3,0.1,31414,12783,13873,738]
[6,6,"Aug",6,1853,382,7.3,80,66.2,29,0.11,24020,12305,11587,69]
[7,6,"Aug",18,13485,766,7.3,80,66.099999999999994,29,0.11,24632,12547,11470,390]
[8,6,"Aug",8,103,13,7.3,80,67.900000000000006,72,0.05,22533,9443,12642,100]
[9,8,"Jan",14,1715,146,3.8,87,41.6,79,0.04,33158,12665,15197,1522]
[10,9,"Jul",15,454,30,12.1,75,66.3,47,0.04,25742,13090,12804,325]
[11,9,"Jul",10,162,16,12.1,75,70.400000000000006,50,0.06,25281,13278,12351,10]
[12,9,"Jul",13,2894,444,12.1,75,64.900000000000006,28,0.05,25227,12418,12612,302]
[13,9,"Aug",7,212,31,6.8,87,62.2,36,0.11,23106,11636,11549,601]
[14,10,"Aug",18,6103,1561,6.7,87,67.099999999999994,43,0.04,25400,12710,12774,100]
[15,10,"Aug",11,6133,764,6.7,87,64.599999999999994,22,0.15,25273,14340,10802,125]
[16,10,"Aug",1,274,274,6.7,87,62.6,13,0.12,21873,7824,11421,1774]
[17,10,"Aug",3,180,66,6.7,87,65.5,47,0.13,24552,12585,11120,727]
[18,10,"Aug",5,1419,364,6.7,87,65.599999999999994,47,0.12,23688,12916,11274,121]
[19,11,"Aug",2,136,68,7.4,80,63.9,17,0.12,21758,9924,11256,1525]
[20,11,"Aug",11,4341,585,7.4,80,63.9,17,0.14000000000000001,25599,13441,10930,1216]
[21,11,"Aug",15,3135,357,7.4,80,71.7,54,0.12,24328,12894,11371,386]
[22,11,"Aug",12,441,38,7.4,80,66.599999999999994,45,0.09,24269,12506,11921,128]
[23,11,"Aug",6,2833,560,7.4,80,66.2,48,0.13,26029,14624,11183,675]
[24,11,"Aug",5,2286,491,7.4,80,68.099999999999994,60,0.14000000000000001,24386,12241,11046,742]
[25,11,"Aug",2,228,136,7.4,80,68.099999999999994,60,0.12,24196,12504,11389,1205]
[26,11,"Aug",17,9826,738,7.4,80,68.400000000000006,60,0.1,23580,11391,11742,458]
[27,12,"Aug",10,1644,164,6.6,88,71.5,74,0.11,23712,12332,11597,124]
[28,12,"Aug",19,17587,1370,6.6,88,72.3,65,0.15,24157,12389,10737,572]
[29,12,"Aug",19,8478,736,6.6,88,71.8,57,0.18,24207,13777,10333,117]
[30,12,"Aug",5,623,127,6.6,88,73.3,63,0.2,20710,10249,9886,67]
[31,12,"Aug",5,136,27,6.6,88,68.5,46,0.12,23809,13173,11391,125]
[32,12,"Aug",3,661,327,6.6,88,68.5,46,0.13,22055,8920,11090,1598]
[33,12,"Aug",6,2815,509,6.6,88,64.099999999999994,29,0.06,24656,11724,12415,707,null,{"$f":"A2","v":"2015 Base with new conservation but no purchase ahead"}]
[34,12,"Aug",6,653,110,6.6,88,62.5,25,0.1,25312,14060,11718,128]
[35,12,"Aug",3,1011,454,6.6,88,62.5,25,0.11,21743,9595,11491,93]
[36,12,"Aug",6,1409,236,6.6,88,73.5,88,0.04,24902,12175,12856,296]
[37,12,"Aug",7,1635,234,6.6,88,66.8,53,0.06,24729,12443,12335,269]
[38,13,"Aug",5,638,252,6.8,86,71.3,54,0.06,23789,11462,12392,78]
[39,13,"Aug",14,16865,1693,6.8,86,68.5,48,0.17,24234,12640,10339,434]
[40,13,"Aug",13,4236,405,6.8,86,74.900000000000006,93,0.09,25068,13125,11918,35]
[41,16,"Jul",14,7870,1605,8.9,91,66.599999999999994,56,0.12,25164,12921,11244,691]
[42,16,"Jul",2,86,51,8.9,91,63.2,19,0.06,23284,11554,12377,196]
[43,16,"Aug",14,1563,113,6.5,89,61.8,5,0.09,25732,13886,11882,236]
[44,17,"Jul",5,1044,209,12.6,72,69.599999999999994,51,0.09,23096,11332,11789,652]
[45,21,"Aug",13,1921,149,7,84,60.5,3,0.09,24666,12596,11849,531]
[46,21,"Aug",2,605,312,7,84,68.5,61,0.05,24020,11418,12612,434]
[47,21,"Aug",5,400,100,7,84,68.900000000000006,63,0.05,23728,11529,12642,385]
[48,29,"Aug",18,22799,1416,6.7,87,62.7,10,0.16,24929,13280,10690,216]
[49,29,"Aug",9,1578,176,6.7,87,62.9,14,0.15,24751,13161,10709,1248]
[50,29,"Aug",3,1427,518,6.7,87,63.2,25,0.12,22178,11092,11321,305,null,null,"Event"]
[51,29,"Aug",4,189,52,6.7,87,63.2,25,0.1,26103,14825,11749,28,null,null,{"$f":"'Event Summary'!P4","v":1}]
[52,29,"Aug",5,362,73,6.7,87,65,38,0.06,24834,12485,12454,411,null,null,null,null,"Event","Curt"]
[53,42,"Aug",10,3704,524,7,84,70.900000000000006,57,0.08,25651,13572,12027,137,null,null,"Mapping","Index","Hour","Mag"]
[54,45,"Aug",1,26,26,6.4,91,66.2,39,7.0000000000000007E-2,25299,12946,12241,562,null,null,{"$f":"CONCATENATE($R$56,\"_\",S59)","v":"1_1"},1,{"$f":"IF(ISERROR(VLOOKUP($R59,'Curtailment Record'!$D$4:$I$3003,5,FALSE)),\"\",VLOOKUP($R59,'Curtailment Record'!$D$4:$I$3003,5,FALSE))","v":16},{"$f":"IF(ISERROR(VLOOKUP($R59,'Curtailment Record'!$D$4:$I$3003,6,FALSE)),\"\",VLOOKUP($R59,'Curtailment Record'!$D$4:$I$3003,6,FALSE))","v":0.7}]
[55,45,"Aug",7,404,64,6.4,91,61.4,28,0.05,24704,11763,12640,954,null,null,{"$f":"CONCATENATE($R$56,\"_\",S60)","v":"1_2"},2,{"$f":"IF(ISERROR(VLOOKUP($R60,'Curtailment Record'!$D$4:$I$3003,5,FALSE)),\"\",VLOOKUP($R60,'Curtailment Record'!$D$4:$I$3003,5,FALSE))","v":17},{"$f":"IF(ISERROR(VLOOKUP($R60,'Curtailment Record'!$D$4:$I$3003,6,FALSE)),\"\",VLOOKUP($R60,'Curtailment Record'!$D$4:$I$3003,6,FALSE))","v":262.39999999999998}]
[56,45,"Aug",2,139,69,6.4,91,62.9,39,7.0000000000000007E-2,24522,12520,12291,388,null,null,"1_3",3,{"$f":"IF(ISERROR(VLOOKUP($R61,'Curtailment Record'!$D$4:$I$3003,5,FALSE)),\"\",VLOOKUP($R61,'Curtailment Record'!$D$4:$I$3003,5,FALSE))","v":18},{"$f":"IF(ISERROR(VLOOKUP($R61,'Curtailment Record'!$D$4:$I$3003,6,FALSE)),\"\",VLOOKUP($R61,'Curtailment Record'!$D$4:$I$3003,6,FALSE))","v":369.5}]
[57,45,"Aug",1,7,7,6.4,91,56.1,12,0.08,22503,11470,12055,-13,null,null,"1_4",4,{"$f":"IF(ISERROR(VLOOKUP($R62,'Curtailment Record'!$D$4:$I$3003,5,FALSE)),\"\",VLOOKUP($R62,'Curtailment Record'!$D$4:$I$3003,5,FALSE))","v":19},{"$f":"IF(ISERROR(VLOOKUP($R62,'Curtailment Record'!$D$4:$I$3003,6,FALSE)),\"\",VLOOKUP($R62,'Curtailment Record'!$D$4:$I$3003,6,FALSE))","v":494.8}]
[58,45,"Aug",1,4,4,6.4,91,56.1,12,0.08,23718,10830,12058,491,null,null,"1_5",5,{"$f":"IF(ISERROR(VLOOKUP($R63,'Curtailment Record'!$D$4:$I$3003,5,FALSE)),\"\",VLOOKUP($R63,'Curtailment Record'!$D$4:$I$3003,5,FALSE))","v":20},{"$f":"IF(ISERROR(VLOOKUP($R63,'Curtailment Record'!$D$4:$I$3003,6,FALSE)),\"\",VLOOKUP($R63,'Curtailment Record'!$D$4:$I$3003,6,FALSE))","v":458.4}]
[59,49,"Jul",18,4780,468,7.3,100,66.5,41,0.1,24944,12334,11701,1039,null,null,"1_6",6,{"$f":"IF(ISERROR(VLOOKUP($R64,'Curtailment Record'!$D$4:$I$3003,5,FALSE)),\"\",VLOOKUP($R64,'Curtailment Record'!$D$4:$I$3003,5,FALSE))","v":21},{"$f":"IF(ISERROR(VLOOKUP($R64,'Curtailment Record'!$D$4:$I$3003,6,FALSE)),\"\",VLOOKUP($R64,'Curtailment Record'!$D$4:$I$3003,6,FALSE))","v":458.4}]
[60,49,"Jul",4,189,47,7.3,100,71.099999999999994,56,0.06,27010,14662,12380,1,null,null,"1_7",7,{"$f":"IF(ISERROR(VLOOKUP($R65,'Curtailment Record'!$D$4:$I$3003,5,FALSE)),\"\",VLOOKUP($R65,'Curtailment Record'!$D$4:$I$3003,5,FALSE))","v":22},{"$f":"IF(ISERROR(VLOOKUP($R65,'Curtailment Record'!$D$4:$I$3003,6,FALSE)),\"\",VLOOKUP($R65,'Curtailment Record'!$D$4:$I$3003,6,FALSE))","v":458.4}]
[61,49,"Aug",18,8342,476,6.5,89,72.7,68,0.05,25446,12588,12617,301,null,null,"1_8",8,{"$f":"IF(ISERROR(VLOOKUP($R66,'Curtailment Record'!$D$4:$I$3003,5,FALSE)),\"\",VLOOKUP($R66,'Curtailment Record'!$D$4:$I$3003,5,FALSE))","v":23},{"$f":"IF(ISERROR(VLOOKUP($R66,'Curtailment Record'!$D$4:$I$3003,6,FALSE)),\"\",VLOOKUP($R66,'Curtailment Record'!$D$4:$I$3003,6,FALSE))","v":406.7}]
[62,49,"Aug",5,1188,248,6.5,89,71.900000000000006,57,0.08,24391,12249,12097,77,null,null,"1_9",9,{"$f":"IF(ISERROR(VLOOKUP($R67,'Curtailment Record'!$D$4:$I$3003,5,FALSE)),\"\",VLOOKUP($R67,'Curtailment Record'!$D$4:$I$3003,5,FALSE))","v":24},{"$f":"IF(ISERROR(VLOOKUP($R67,'Curtailment Record'!$D$4:$I$3003,6,FALSE)),\"\",VLOOKUP($R67,'Curtailment Record'!$D$4:$I$3003,6,FALSE))","v":406.7}]
[63,50,"Aug",17,3416,321,8.1999999999999993,71,61.7,31,0.16,24112,13567,10627,306,null,null,"1_10",10,{"$f":"IF(ISERROR(VLOOKUP($R68,'Curtailment Record'!$D$4:$I$3003,5,FALSE)),\"\",VLOOKUP($R68,'Curtailment Record'!$D$4:$I$3003,5,FALSE))","v":""},{"$f":"IF(ISERROR(VLOOKUP($R68,'Curtailment Record'!$D$4:$I$3003,6,FALSE)),\"\",VLOOKUP($R68,'Curtailment Record'!$D$4:$I$3003,6,FALSE))","v":""}]
[64,52,"Aug",8,3170,890,6.3,92,63.5,30,0.17,22689,12324,10483,96,null,null,"1_11",11,{"$f":"IF(ISERROR(VLOOKUP($R69,'Curtailment Record'!$D$4:$I$3003,5,FALSE)),\"\",VLOOKUP($R69,'Curtailment Record'!$D$4:$I$3003,5,FALSE))","v":""},{"$f":"IF(ISERROR(VLOOKUP($R69,'Curtailment Record'!$D$4:$I$3003,6,FALSE)),\"\",VLOOKUP($R69,'Curtailment Record'!$D$4:$I$3003,6,FALSE))","v":""}]
[65,52,"Aug",18,8432,599,6.3,92,63.1,25,0.16,24117,13108,10531,535,null,null,"1_12",12,{"$f":"IF(ISERROR(VLOOKUP($R70,'Curtailment Record'!$D$4:$I$3003,5,FALSE)),\"\",VLOOKUP($R70,'Curtailment Record'!$D$4:$I$3003,5,FALSE))","v":""},{"$f":"IF(ISERROR(VLOOKUP($R70,'Curtailment Record'!$D$4:$I$3003,6,FALSE)),\"\",VLOOKUP($R70,'Curtailment Record'!$D$4:$I$3003,6,FALSE))","v":""}]
[66,52,"Aug",1,189,189,6.3,92,62.5,9,0.16,19688,6959,10569,1393,null,null,"1_13",13,{"$f":"IF(ISERROR(VLOOKUP($R71,'Curtailment Record'!$D$4:$I$3003,5,FALSE)),\"\",VLOOKUP($R71,'Curtailment Record'!$D$4:$I$3003,5,FALSE))","v":""},{"$f":"IF(ISERROR(VLOOKUP($R71,'Curtailment Record'!$D$4:$I$3003,6,FALSE)),\"\",VLOOKUP($R71,'Curtailment Record'!$D$4:$I$3003,6,FALSE))","v":""}]
[67,52,"Aug",6,2143,830,6.3,92,62.5,9,0.16,21945,11170,10572,330,null,null,"1_14",14,{"$f":"IF(ISERROR(VLOOKUP($R72,'Curtailment Record'!$D$4:$I$3003,5,FALSE)),\"\",VLOOKUP($R72,'Curtailment Record'!$D$4:$I$3003,5,FALSE))","v":""},{"$f":"IF(ISERROR(VLOOKUP($R72,'Curtailment Record'!$D$4:$I$3003,6,FALSE)),\"\",VLOOKUP($R72,'Curtailment Record'!$D$4:$I$3003,6,FALSE))","v":""}]
[68,52,"Aug",18,7872,785,6.3,92,66.7,33,0.13,25146,13788,11204,64,null,null,"1_15",15,{"$f":"IF(ISERROR(VLOOKUP($R73,'Curtailment Record'!$D$4:$I$3003,5,FALSE)),\"\",VLOOKUP($R73,'Curtailment Record'!$D$4:$I$3003,5,FALSE))","v":""},{"$f":"IF(ISERROR(VLOOKUP($R73,'Curtailment Record'!$D$4:$I$3003,6,FALSE)),\"\",VLOOKUP($R73,'Curtailment Record'!$D$4:$I$3003,6,FALSE))","v":""}]
[69,52,"Aug",16,7200,541,6.3,92,68.400000000000006,38,0.16,23934,11463,10659,1012,null,null,"1_16",16,{"$f":"IF(ISERROR(VLOOKUP($R74,'Curtailment Record'!$D$4:$I$3003,5,FALSE)),\"\",VLOOKUP($R74,'Curtailment Record'!$D$4:$I$3003,5,FALSE))","v":""},{"$f":"IF(ISERROR(VLOOKUP($R74,'Curtailment Record'!$D$4:$I$3003,6,FALSE)),\"\",VLOOKUP($R74,'Curtailment Record'!$D$4:$I$3003,6,FALSE))","v":""}]
[70,52,"Aug",1,337,337,6.3,92,73.2,61,0.17,19992,6819,10334,1923,null,null,"1_17",17,{"$f":"IF(ISERROR(VLOOKUP($R75,'Curtailment Record'!$D$4:$I$3003,5,FALSE)),\"\",VLOOKUP($R75,'Curtailment Record'!$D$4:$I$3003,5,FALSE))","v":""},{"$f":"IF(ISERROR(VLOOKUP($R75,'Curtailment Record'!$D$4:$I$3003,6,FALSE)),\"\",VLOOKUP($R75,'Curtailment Record'!$D$4:$I$3003,6,FALSE))","v":""}]
[71,52,"Aug",44,36930,2181,6.3,92,70.900000000000006,54,0.16,24806,12998,10601,692,null,null,"1_18",18,{"$f":"IF(ISERROR(VLOOKUP($R76,'Curtailment Record'!$D$4:$I$3003,5,FALSE)),\"\",VLOOKUP($R76,'Curtailment Record'!$D$4:$I$3003,5,FALSE))","v":""},{"$f":"IF(ISERROR(VLOOKUP($R76,'Curtailment Record'!$D$4:$I$3003,6,FALSE)),\"\",VLOOKUP($R76,'Curtailment Record'!$D$4:$I$3003,6,FALSE))","v":""}]
[72,52,"Aug",10,1780,200,6.3,92,65.5,26,0.13,26338,15510,11071,84,null,null,"1_19",19,{"$f":"IF(ISERROR(VLOOKUP($R77,'Curtailment Record'!$D$4:$I$3003,5,FALSE)),\"\",VLOOKUP($R77,'Curtailment Record'!$D$4:$I$3003,5,FALSE))","v":""},{"$f":"IF(ISERROR(VLOOKUP($R77,'Curtailment Record'!$D$4:$I$3003,6,FALSE)),\"\",VLOOKUP($R77,'Curtailment Record'!$D$4:$I$3003,6,FALSE))","v":""}]
[73,52,"Aug",19,1843,389,6.3,92,64.3,34,0.14000000000000001,24473,13602,11029,210,null,null,"1_20",20,{"$f":"IF(ISERROR(VLOOKUP($R78,'Curtailment Record'!$D$4:$I$3003,5,FALSE)),\"\",VLOOKUP($R78,'Curtailment Record'!$D$4:$I$3003,5,FALSE))","v":""},{"$f":"IF(ISERROR(VLOOKUP($R78,'Curtailment Record'!$D$4:$I$3003,6,FALSE)),\"\",VLOOKUP($R78,'Curtailment Record'!$D$4:$I$3003,6,FALSE))","v":""}]
[74,52,"Aug",3,402,218,6.3,92,61.9,30,0.04,23660,10957,12751,653,null,null,"1_21",21,{"$f":"IF(ISERROR(VLOOKUP($R79,'Curtailment Record'!$D$4:$I$3003,5,FALSE)),\"\",VLOOKUP($R79,'Curtailment Record'!$D$4:$I$3003,5,FALSE))","v":""},{"$f":"IF(ISERROR(VLOOKUP($R79,'Curtailment Record'!$D$4:$I$3003,6,FALSE)),\"\",VLOOKUP($R79,'Curtailment Record'!$D$4:$I$3003,6,FALSE))","v":""}]
[75,52,"Aug",11,814,102,6.3,92,56.6,12,7.0000000000000007E-2,23579,11028,12308,575,null,null,"1_22",22,{"$f":"IF(ISERROR(VLOOKUP($R80,'Curtailment Record'!$D$4:$I$3003,5,FALSE)),\"\",VLOOKUP($R80,'Curtailment Record'!$D$4:$I$3003,5,FALSE))","v":""},{"$f":"IF(ISERROR(VLOOKUP($R80,'Curtailment Record'!$D$4:$I$3003,6,FALSE)),\"\",VLOOKUP($R80,'Curtailment Record'!$D$4:$I$3003,6,FALSE))","v":""}]
{"$rows_left_out":250}