{"text_format":"1","workbook":"xlsx","n_sheets":5,"sheets":["Adequacy","Curtailment Record","Event Summary","Duration Curves","Monthly"],"not_rendered":{"charts":13,"images":2,"macros":1,"external_links":1,"defined_names":2,"comments":0,"pivot_tables":0},"unopened":[],"bounds":{"document_bytes":16777216,"sheet_cells":100000,"rows_first":2000,"rows_last":500,"rows_between":2000,"halvings":0,"cell_chars":16384,"cell_head_chars":4096},"cells_cut":0,"cells_raw":0,"read":"whole","date_system":"1900"}

{"sheet":"Adequacy","index":0,"n_rows":24,"n_cols":11,"rows_kept":24,"cut":false,"hidden":false,"merged":[[3,0,3,3],[3,5,3,9]]}
["Adequacy Assessment Summary"]
["Base Case: 2015, 210 games, hist wind (08-10), sequential hydro, lockstep temperature, Purchase Ahead ON"]
[]
["Previous Metrics",null,null,null,"New","Other Metrics"]
["LOLP","LOLP","LOLP","LOLP","LOLP"," ","CVaR ","CVaR "]
["W Cap","W Eng","S Cap","S Eng","Annual","EERD","Energy","Peak","EUE","LOLE"]
["%","%","%","%","%","%","MW-Hrs","MW","MW/Hr","Hrs/Yr"]
[]
[2.4,0.5,0,0,2.4,7.1,43599.199999999997,2815.4,0.2,1.8]
[]
[]
["LOLP W Cap = Winter Capacity LOLP"]
["LOLP W Eng = Winter Energy LOLP"]
["LOLP S Cap = Summer Capacity LOLP"]
["LOLP S Eng = Summer Energy LOLP"]
["LOLP Annual = Annual LOLP (counts all \"bad\" events)"]
["EERD = Expected Emergency Resource Dispatch = number of games ER used/total number of games"]
["CVaR Energy = Average of 5% worst games sorted by total annual curtailment (mw-hours)"]
["CVaR Peak = Average of 5% worst games sorted by highest hour curtailment (mw)"]
["EUE = Expected Unserved Energy = total curtailment over all games/(number of hours*number of games)"]
["LOLE = Loss of Load Expectation = total number of hours of curtailment/number of games"]
[]
[]
[null,null,null,null,null,null,null,null,null,null," "]

{"sheet":"Curtailment Record","index":1,"n_rows":4003,"n_cols":24,"rows_kept":4003,"cut":false,"hidden":false,"merged":[[0,8,0,9]]}
["Maximum of 4000 Curtailment Entries",null,null,null,"Curtailment Records",null,null,null,null,null,"Warning: Cannot Undo a Clear"]
[null,null,null,null,null,null,null,null,null,null,{"$f":"IF($A$4004=\"\",\"\",\"Error: Too Many Records!\")","v":""}]
["Event Hour Mapping","Event","Event Hour counter","Event-Hour Counter mapping","Sim","Month","Day","Hour","Curt","Rviol","Wat Yr","Temp Yr","Wind Yr","Load","Rreq","Arsrv","Thr","Purc","Hydro","Wind","FO MW","Per FO","WCF","Sliceacc"]
[{"$f":"CONCATENATE(B4,\"_\",H4)","v":"1_1"},1,1,{"$f":"CONCATENATE(B4,\"_\",C4)","v":"1_1"},4,3,10,1,1793.9,0,1932,1932,1,27520,2850,0,15409,3000,6368,124,601,2.9000000000000001E-2,0.04,0]
[{"$f":"CONCATENATE(B5,\"_\",H5)","v":"1_2"},{"$f":"IF(E5=E4,    (IF(F5=F4,    (IF(G5=G4,   (IF(H5=H4+1,B4,B4+1)), (IF(AND(G5=G4+1,H5=1,H4=24),B4,B4+1)))), B4+1)), B4+1)","v":1},{"$f":"IF(B5=B4,C4+1,1)","v":2},{"$f":"CONCATENATE(B5,\"_\",C5)","v":"1_2"},4,3,10,2,1035.0999999999999,0,1932,1932,1,26947,2850,0,15409,3000,6368,310,601,2.9000000000000001E-2,0.1,0]
["1_3",{"$f":"IF(E6=E5,    (IF(F6=F5,    (IF(G6=G5,   (IF(H6=H5+1,B5,B5+1)), (IF(AND(G6=G5+1,H6=1,H5=24),B5,B5+1)))), B5+1)), B5+1)","v":1},{"$f":"IF(B6=B5,C5+1,1)","v":3},{"$f":"CONCATENATE(B6,\"_\",C6)","v":"1_3"},4,3,10,3,937.5,0,1932,1932,1,26764,2850,0,15075,3000,6368,558,934,4.5999999999999999E-2,0.18,0]
["1_4",1,4,"1_4",4,3,10,4,1319.7,0,1932,1932,1,27050,2850,0,14948,3000,6368,589,1061,5.1999999999999998E-2,0.19,0]
["1_5",1,5,"1_5",4,3,10,5,2274.6,0,1932,1932,1,28097,2850,0,14669,3000,6368,960,1341,6.5000000000000002E-2,0.31,0]
["1_6",1,6,"1_6",4,3,10,6,3780.4,0,1932,1932,1,30616,2850,0,14484,3000,7411,1115,1526,7.3999999999999996E-2,0.36,0]
["1_7",1,7,"1_7",4,3,10,7,822.7,0,1932,1932,1,34269,2850,0,14484,3000,14713,1301,1526,7.3999999999999996E-2,0.42,0]
["1_8",1,8,"1_8",4,3,10,8,822.7,0,1932,1932,1,36631,2850,0,14484,3000,16641,1735,1526,7.3999999999999996E-2,0.56000000000000005,0]
["1_9",1,9,"1_9",4,3,10,9,822.7,0,1932,1932,1,37083,2850,0,14484,3000,16597,2231,1526,7.3999999999999996E-2,0.72,0]
["1_10",1,10,"1_10",4,3,10,10,822.7,0,1932,1932,1,36862,2850,0,14484,3000,15973,2633,1526,7.3999999999999996E-2,0.85,0]
["1_11",1,11,"1_11",4,3,10,11,822.7,0,1932,1932,1,36303,2850,0,14484,3000,15260,2788,1526,7.3999999999999996E-2,0.9,0]
["1_12",1,12,"1_12",4,3,10,12,822.7,0,1932,1932,1,35484,2850,0,14484,3000,13901,2788,1526,7.3999999999999996E-2,0.9,0]
["1_13",1,13,"1_13",4,3,10,13,822.7,0,1932,1932,1,34755,2850,0,14484,3000,12486,2664,1526,7.3999999999999996E-2,0.86,0]
["1_14",1,14,"1_14",4,3,10,14,822.7,0,1932,1932,1,34119,2850,0,14484,3000,12097,2416,1526,7.3999999999999996E-2,0.78,0]
["1_15",1,15,"1_15",4,3,10,15,822.7,0,1932,1932,1,33784,2850,0,14484,3000,12196,1983,1526,7.3999999999999996E-2,0.64,0]
["1_16",1,16,"1_16",4,3,10,16,822.7,0,1932,1932,1,34272,2850,0,14484,3000,13975,1518,1526,7.3999999999999996E-2,0.49,0]
["1_17",1,17,"1_17",4,3,10,17,822.7,0,1932,1932,1,36590,2850,0,14484,3000,17375,960,1526,7.3999999999999996E-2,0.31,0]
["1_18",1,18,"1_18",4,3,10,18,822.7,0,1932,1932,1,38729,2850,0,14484,3000,19792,682,1526,7.3999999999999996E-2,0.22,0]
["1_19",1,19,"1_19",4,3,10,19,822.7,0,1932,1932,1,38519,2850,0,14484,3000,19830,434,1526,7.3999999999999996E-2,0.14000000000000001,0]
["1_20",1,20,"1_20",4,3,10,20,822.7,0,1932,1932,1,37538,2850,0,14484,3000,19066,217,1526,7.3999999999999996E-2,7.0000000000000007E-2,0]
["1_21",1,21,"1_21",4,3,10,21,822.7,0,1932,1932,1,36333,2850,0,14484,3000,17954,124,1526,7.3999999999999996E-2,0.04,0]
["1_22",1,22,"1_22",4,3,10,22,822.7,0,1932,1932,1,34504,2850,0,14484,3000,15617,93,1526,7.3999999999999996E-2,0.03,0]
["1_23",1,23,"1_23",4,3,10,23,4398.2,0,1932,1932,1,31758,2850,0,13866,3000,9545,124,2144,0.105,0.04,0]
["1_24",1,24,"1_24",4,3,10,24,3832.8,0,1932,1932,1,29187,2850,0,14431,3000,6880,217,1578,7.6999999999999999E-2,7.0000000000000007E-2,0]
["1_1",1,25,"1_25",4,3,11,1,2278.9,0,1932,1932,1,27274,2850,0,14444,3000,6293,434,1566,7.5999999999999998E-2,0.14000000000000001,0]
["1_2",1,26,"1_26",4,3,11,2,1130.0999999999999,0,1932,1932,1,26686,2850,0,14602,3000,6293,836,1408,6.9000000000000006E-2,0.27,0]
["1_3",1,27,"1_27",4,3,11,3,189.6,0,1932,1932,1,26514,2850,0,14689,3000,6293,1518,1321,6.4000000000000001E-2,0.49,0]
["1_4",1,28,"1_28",4,3,11,4,214.7,0,1932,1932,1,26818,2850,0,14689,3000,6293,1797,1321,6.4000000000000001E-2,0.57999999999999996,0]
["1_5",1,29,"1_29",4,3,11,5,1317.9,0,1932,1932,1,27921,2850,0,14689,3000,6293,1797,1321,6.4000000000000001E-2,0.57999999999999996,0]
["1_6",1,30,"1_30",4,3,11,6,3282.5,0,1932,1932,1,30575,2850,0,14689,3000,6796,1983,1321,6.4000000000000001E-2,0.64,0]
["1_7",1,31,"1_31",4,3,11,7,324.8,0,1932,1932,1,34385,2850,0,14689,3000,14285,2138,1321,6.4000000000000001E-2,0.69,0]
["1_8",1,32,"1_32",4,3,11,8,324.8,0,1932,1932,1,36718,2850,0,14689,3000,16680,2076,1321,6.4000000000000001E-2,0.67,0]
["1_9",1,33,"1_33",4,3,11,9,324.8,0,1932,1932,1,37010,2850,0,14689,3000,16817,2231,1321,6.4000000000000001E-2,0.72,0]
["1_10",1,34,"1_34",4,3,11,10,324.8,0,1932,1932,1,36692,2850,0,14689,3000,16654,2076,1321,6.4000000000000001E-2,0.67,0]
["1_11",1,35,"1_35",4,3,11,11,324.8,0,1932,1932,1,36111,2850,0,14689,3000,16135,2014,1321,6.4000000000000001E-2,0.65,0]
["1_12",1,36,"1_36",4,3,11,12,324.8,0,1932,1932,1,35297,2850,0,14689,3000,14751,2045,1321,6.4000000000000001E-2,0.66,0]
["1_13",1,37,"1_37",4,3,11,13,324.8,0,1932,1932,1,34591,2850,0,14689,3000,13172,2107,1321,6.4000000000000001E-2,0.68,0]
["1_14",1,38,"1_38",4,3,11,14,324.8,0,1932,1932,1,33982,2850,0,14689,3000,12625,2045,1321,6.4000000000000001E-2,0.66,0]
["2_7",2,1,"2_1",12,11,7,7,847.1,0,1940,1940,1,20920,2850,0,10506,0,10335,248,2977,0.16600000000000001,0.08,0]
["2_8",2,2,"2_2",12,11,7,8,847.1,0,1940,1940,1,22492,1329,0,10506,0,11876,279,2977,0.16600000000000001,0.09,0]
["2_9",2,3,"2_3",12,11,7,9,971.9,0,1940,1940,1,23710,1389,0,10381,0,13249,124,3102,0.17299999999999999,0.04,0]
["2_10",2,4,"2_4",12,11,7,10,910.2,0,1940,1940,1,24632,1443,0,10443,0,14233,62,3041,0.16900000000000001,0.02,0]
["2_11",2,5,"2_5",12,11,7,11,906.6,0,1940,1940,1,25285,1477,0,10446,0,14917,31,3037,0.16900000000000001,0.01,0]
["2_12",2,6,"2_6",12,11,7,12,906.6,0,1940,1940,1,25691,1470,0,10446,0,14783,31,3037,0.16900000000000001,0.01,0]
["2_13",2,7,"2_7",12,11,7,13,906.6,0,1940,1940,1,26004,1447,0,10446,0,14316,0,3037,0.16900000000000001,0,0]
["2_14",2,8,"2_8",12,11,7,14,970.1,0,1940,1940,1,26220,1453,0,10383,0,14532,0,3100,0.17199999999999999,0,0]
["2_15",2,9,"2_9",12,11,7,15,992.9,0,1940,1940,1,26350,1457,0,10360,0,14631,31,3123,0.17399999999999999,0.01,0]
["2_16",2,10,"2_10",12,11,7,16,933.5,0,1940,1940,1,26442,1507,0,10419,0,15549,31,3064,0.17,0.01,0]
["2_17",2,11,"2_11",12,11,7,17,933.5,0,1940,1940,1,26541,1540,0,10419,0,16204,0,3064,0.17,0,0]
["2_18",2,12,"2_12",12,11,7,18,1166.5,0,1940,1940,1,26392,1516,0,10186,0,16055,0,3297,0.183,0,0]
["2_19",{"$f":"IF(E54=E53,    (IF(F54=F53,    (IF(G54=G53,   (IF(H54=H53+1,B53,B53+1)), (IF(AND(G54=G53+1,H54=1,H53=24),B53,B53+1)))), B53+1)), B53+1)","v":2},13,"2_13",12,11,7,19,1222.5,0,1940,1940,1,26053,1495,0,10130,0,15716,0,3353,0.186,0,0]
["2_20",{"$f":"IF(E55=E54,    (IF(F55=F54,    (IF(G55=G54,   (IF(H55=H54+1,B54,B54+1)), (IF(AND(G55=G54+1,H55=1,H54=24),B54,B54+1)))), B54+1)), B54+1)","v":2},14,"2_14",12,11,7,20,1222.5,0,1940,1940,1,25700,1476,0,10130,0,15332,31,3353,0.186,0.01,0]
["2_21",2,15,"2_15",12,11,7,21,1222.5,0,1940,1940,1,25496,1466,0,10130,0,15128,31,3353,0.186,0.01,0]
["2_22",2,16,"2_16",12,11,7,22,1147.7,0,1940,1940,1,24656,1394,0,10205,0,13593,186,3278,0.182,0.06,0]
["2_23",2,17,"2_17",12,11,7,23,1042.7,0,1940,1940,1,22564,1091,0,10311,3000,7383,248,3172,0.17599999999999999,0.08,0]
["2_24",2,18,"2_18",12,11,7,24,208.2,0,1940,1940,1,20510,2850,0,10311,3000,6040,372,3172,0.17599999999999999,0.12,0]
["3_5",3,1,"3_1",13,4,5,5,882.3,0,1941,1941,1,25410,2850,0,14598,3000,5912,62,1422,6.9000000000000006E-2,0.02,0]
{"$rows_left_out":3944}
{"sheet":"Event Summary","index":2,"n_rows":178,"n_cols":29,"rows_kept":178,"cut":false,"hidden":false,"merged":[[4,11,4,14],[1,20,1,23]]}
["Curtailment Event Summary",null,null,null,null,null,null,null,null,null,null,null,null,null,null,"Prototype Spinner Chart - 2015 Assessment",null,null,null,null,null,null,null,null,null,"Wind Capacity",null,3096,"<< Input"]
["Base Case, Historic (2008-10) wind, 210 games sequential hydro, lockstep temperature",null,null,null,null,null,null,null,null,null,null,null,null,null,null,null,null,null,null,null,"Percent of Range"]
["Includes purchase ahead option",null,null,null,null,null,null,null,null,null,null,null,null,null," ","Event","Dur","Mag","Avg Mag","Peak","Hyd","Temp","Thr","Wind","Load","Hydro","Therm","Month","Game"]
[null,null,null,"Dur","Mag","Peak","ROff","Hyd","Event","Temp","FOut","Dem","Hydro","Therm","Wind",1,{"$f":"LOOKUP(P4,A6:A400,D6:D400)","v":38},{"$f":"LOOKUP(P4,A6:A400,E6:E400)","v":43548},{"$f":"R4/Q4","v":1146},{"$f":"LOOKUP(P4,A6:A400,F6:F400)","v":4398},{"$f":"100-LOOKUP(P4,A6:A400,H6:H400)","v":3},{"$f":"LOOKUP(P4,A6:A400,J6:J400)","v":2},{"$f":"100-LOOKUP(P4,A6:A400,K6:K400)*100","v":93},{"$f":"LOOKUP(P4,A6:A400,O6:O400)*100/$AB$1","v":45.60723514211886},{"$f":"LOOKUP(P4,A6:A400,L6:L400)","v":33008},{"$f":"LOOKUP(P4,A6:A400,M6:M400)","v":12330},{"$f":"LOOKUP(P4,A6:A400,N6:N400)","v":14614},{"$f":"LOOKUP(P4,A6:A400,C6:C400)","v":"Dec"},{"$f":"LOOKUP(P4,A6:A400,B6:B400)","v":4}]
["No","Game","Mon","hours","mw-hrs","mw-hrs","maf","(%)","Temp","(%)","(%)","(averaged over the event)"]
[1,4,"Dec",38,43548,4398,3.4,97,15.9,2,7.0000000000000007E-2,33008,12330,14614,1412]
[2,12,"Aug",18,17359,1222,6.6,88,71.8,57,0.17,24759,13548,10342,95,null,null,null,null,null,null,null,null,null,null,null,null,null,"Cycle"]
[3,13,"Jan",2,1832,950,4.5,81,32.299999999999997,51,7.0000000000000007E-2,26526,6994,14598,62,null,null,null,null,null,null,null,null,null,null,null,null,null,"Thru"]
[4,49,"Aug",17,7227,766,6.5,89,71.900000000000006,57,0.06,25923,13392,12449,69,null,null,null,null,null,null,null,null,null,null,null,null,null,"Events"]
[5,52,"Aug",8,2591,363,6.3,92,66.5,33,0.13,25889,14147,11108,108]
[6,64,"Aug",12,8703,760,5.6,100,66.3,39,7.0000000000000007E-2,27712,14236,12174,738]
[7,64,"Aug",17,13298,878,5.6,100,67.7,53,0.08,25702,13092,12005,235]
[8,64,"Aug",17,1669,268,5.6,100,64,18,0.08,25217,12965,12094,472]
[9,75,"Dec",30,56416,4695,3.4,97,16.899999999999999,6,0.08,33142,12368,14447,941]
[10,75,"Dec",7,4778,3057,3.4,97,16.399999999999999,3,7.0000000000000007E-2,32944,12427,14496,2014]
[11,75,"Dec",2,913,774,3.4,97,15.8,2,0.01,28230,6940,15847,1162]
[12,75,"Dec",3,4365,2429,3.4,97,15.1,0,0,28438,6794,15981,382]
[13,75,"Dec",1,93,93,3.4,97,15.1,0,0,28963,7886,15981,1177]
[14,79,"Jan",18,52014,5614,3.8,87,41.6,79,0.09,36007,14851,14091,780]
[15,79,"Jan",3,3413,2299,3.8,87,42,86,0.12,26230,6379,13560,1198]
[16,84,"Jan",6,7696,1886,4.5,81,32.299999999999997,51,0.12,25211,6353,13449,170]
[17,107,"Dec",2,131,65,4.3,90,7.8,0,0.08,26616,8410,14284,31]
[18,107,"Dec",3,196,65,4.3,90,7.8,0,0.08,27894,9689,14284,31]
[19,120,"Aug",9,1725,398,6.5,89,73.7,87,0.08,25935,13626,12016,338]
[20,120,"Aug",7,3014,570,6.5,89,72.7,68,7.0000000000000007E-2,24960,12686,12279,310]
[21,120,"Aug",7,1384,218,6.5,89,72.7,68,0.05,26390,13409,12512,554]
[22,120,"Aug",18,15535,1388,6.5,89,71.900000000000006,57,0.08,25664,12869,12056,67]
[23,128,"Aug",8,2985,566,6,96,67,42,0.16,25764,14202,10586,910]
[24,128,"Aug",17,14702,1196,6,96,66.5,46,0.16,24636,13410,10539,235]
[25,128,"Aug",16,15168,1422,6,96,67.400000000000006,37,0.13,25624,13786,11089,463]
[26,128,"Aug",17,9575,564,6,96,61.9,12,0.08,25756,13480,12056,69]
[27,131,"Aug",1,31,31,5.9,96,62.2,7,0.15,19774,6888,10727,1549]
[28,146,"Dec",59,137907,5701,3.4,97,16.600000000000001,5,0.09,33463,12808,14075,781]
[29,146,"Dec",2,3757,2860,3.4,97,15.1,0,0.04,29248,6549,15106,1890]
[30,146,"Dec",7,3027,432,3.4,97,15.1,0,7.0000000000000007E-2,36038,16271,14576,1350]
[31,146,"Dec",2,5720,2860,3.4,97,15.1,0,0.04,30246,8114,15106,341]
[32,206,"Aug",8,2170,278,5.6,100,67.7,53,0.06,26234,13442,12473,356]
[]
[]
[]
[]
[]
[]
[]
[]
[]
[]
[]
[]
[]
[]
[]
[]
[]
[null,null,null,null,null,null,null,null,null,null,null,null,null,null,null,null,null,"Event"]
[null,null,null,null,null,null,null,null,null,null,null,null,null,null,null,null,null,{"$f":"'Event Summary'!P4","v":1}]
[null,null,null,null,null,null,null,null,null,null,null,null,null,null,null,null,null,null,null,"Event","Curt"]
[null,null,null,null,null,null,null,null,null,null,null,null,null,null,null,null,null,"Mapping","Index","Hour","Mag"]
[null,null,null,null,null,null,null,null,null,null,null,null,null,null,null,null,null,{"$f":"CONCATENATE($R$56,\"_\",S59)","v":"1_1"},1,{"$f":"IF(ISERROR(VLOOKUP($R59,'Curtailment Record'!$D$4:$I$4003,5,FALSE)),\"\",VLOOKUP($R59,'Curtailment Record'!$D$4:$I$4003,5,FALSE))","v":1},{"$f":"IF(ISERROR(VLOOKUP($R59,'Curtailment Record'!$D$4:$I$4003,6,FALSE)),\"\",VLOOKUP($R59,'Curtailment Record'!$D$4:$I$4003,6,FALSE))","v":1793.9}]
[null,null,null,null,null,null,null,null,null,null,null,null,null,null,null,null,null,{"$f":"CONCATENATE($R$56,\"_\",S60)","v":"1_2"},2,{"$f":"IF(ISERROR(VLOOKUP($R60,'Curtailment Record'!$D$4:$I$4003,5,FALSE)),\"\",VLOOKUP($R60,'Curtailment Record'!$D$4:$I$4003,5,FALSE))","v":2},{"$f":"IF(ISERROR(VLOOKUP($R60,'Curtailment Record'!$D$4:$I$4003,6,FALSE)),\"\",VLOOKUP($R60,'Curtailment Record'!$D$4:$I$4003,6,FALSE))","v":1035.0999999999999}]
{"$rows_left_out":119}
{"sheet":"Duration Curves","index":3,"n_rows":215,"n_cols":6,"rows_kept":215,"cut":false,"hidden":false,"merged":[]}
[null,"Duration Curve Data",null,null,"Games",210]
[]
[]
["(%)","(mw-hours)","(mw)"]
["Probability","Total Annual","Highest Hour"]
[{"$f":"1/210","v":4.7619047619047623E-3},150411,5701]
[{"$f":"A6+1/210","v":9.5238095238095247E-3},66565,5614]
[{"$f":"A7+1/210","v":1.4285714285714287E-2},55427,4695]
[1.9047619047619049E-2,43548,4398]
[2.3809523809523812E-2,42430,1886]
[2.8571428571428574E-2,23670,1422]
[3.333333333333334E-2,21658,1388]
[3.8095238095238099E-2,17359,1222]
[4.2857142857142858E-2,7696,950]
[4.7619047619047616E-2,7227,878]
[5.2380952380952375E-2,2591,766]
[5.7142857142857134E-2,2170,363]
[6.1904761904761893E-2,1832,278]
[6.6666666666666652E-2,327,65]
[7.1428571428571411E-2,31,31]
[7.619047619047617E-2,0,0]
[8.0952380952380928E-2,0,0]
[8.5714285714285687E-2,0,0]
[9.0476190476190446E-2,0,0]
[9.5238095238095205E-2,0,0]
[9.9999999999999964E-2,0,0]
[0.10476190476190472,0,0]
[0.10952380952380948,0,0]
[0.11428571428571424,0,0]
[0.119047619047619,0,0]
[0.12380952380952376,0,0]
[0.12857142857142853,0,0]
[0.1333333333333333,0,0]
[0.13809523809523808,0,0]
[0.14285714285714285,0,0]
[0.14761904761904762,0,0]
[0.15238095238095239,0,0]
[0.15714285714285717,0,0]
[0.16190476190476194,0,0]
[0.16666666666666671,0,0]
[0.17142857142857149,0,0]
[0.17619047619047626,0,0]
[0.18095238095238103,0,0]
[0.1857142857142858,0,0]
[0.19047619047619058,0,0]
[0.19523809523809535,0,0]
[0.20000000000000012,0,0]
[0.20476190476190489,0,0]
[0.20952380952380967,0,0]
[0.21428571428571444,0,0]
[0.21904761904761921,0,0]
[0.22380952380952399,0,0]
[0.22857142857142876,0,0]
[0.23333333333333353,0,0]
[0.2380952380952383,0,0]
[0.24285714285714308,0,0]
[0.24761904761904785,0,0]
[0.25238095238095259,0,0]
[0.25714285714285734,0,0]
[0.26190476190476208,0,0]
{"$rows_left_out":156}
{"sheet":"Monthly","index":4,"n_rows":385,"n_cols":27,"rows_kept":385,"cut":false,"hidden":false,"merged":[]}
["Curtailment records",null,null,"Base case: 210 games, sequential hydro, lockstep temp, historical wind, purchase ahead is ON",null,null,null,null,null,null,null,null,null,null,null,null,null,null,null,null,null,null,null,"Sorted Monthly Data"]
[]
["Game","Month","Day","Hour","Curt","R Viol","Wyr","Tyr","Wind Yr","Load","R Req","AR srv","Therm","Purch","Hydro","Wind","FOMW","PerFO","WCF","Slicacc",null,null,null,null,"Prob","Energy ","Peak"]
[4,3,10,1,1793.9,0,1932,1932,1,27520,2850,0,15409,3000,6368,124,601,2.9000000000000001E-2,0.04,0,null,null,null,"Aug",{"$f":"1/210","v":4.7619047619047623E-3},42430.399999999958,1422.4]
[4,3,10,2,1035.0999999999999,0,1932,1932,1,26947,2850,0,15409,3000,6368,310,601,2.9000000000000001E-2,0.1,0,null,null,null,"Aug",{"$f":"Y4+1/210","v":9.5238095238095247E-3},23669.900000000009,1387.7]
[4,3,10,3,937.5,0,1932,1932,1,26764,2850,0,15075,3000,6368,558,934,4.5999999999999999E-2,0.18,0,null,null,null,"Aug",{"$f":"Y5+1/210","v":1.4285714285714287E-2},21658.5,1222.5]
[4,3,10,4,1319.7,0,1932,1932,1,27050,2850,0,14948,3000,6368,589,1061,5.1999999999999998E-2,0.19,0,null,null,null,"Aug",1.9047619047619049E-2,17358.700000000004,877.6]
[4,3,10,5,2274.6,0,1932,1932,1,28097,2850,0,14669,3000,6368,960,1341,6.5000000000000002E-2,0.31,0,null,null,null,"Aug",2.3809523809523812E-2,7227.3999999999987,766.5]
[4,3,10,6,3780.4,0,1932,1932,1,30616,2850,0,14484,3000,7411,1115,1526,7.3999999999999996E-2,0.36,0,null,null,null,"Aug",2.8571428571428574E-2,2591.4,363.1]
[4,3,10,7,822.7,0,1932,1932,1,34269,2850,0,14484,3000,14713,1301,1526,7.3999999999999996E-2,0.42,0,null,null,null,"Aug",3.333333333333334E-2,2170.1000000000004,278.3]
[4,3,10,8,822.7,0,1932,1932,1,36631,2850,0,14484,3000,16641,1735,1526,7.3999999999999996E-2,0.56000000000000005,0,null,null,null,"Aug",3.8095238095238099E-2,31.2,31.2]
[4,3,10,9,822.7,0,1932,1932,1,37083,2850,0,14484,3000,16597,2231,1526,7.3999999999999996E-2,0.72,0,null,null,null,"Aug",4.2857142857142858E-2,0,0]
[4,3,10,10,822.7,0,1932,1932,1,36862,2850,0,14484,3000,15973,2633,1526,7.3999999999999996E-2,0.85,0,null,null,null,"Dec",{"$f":"1/210","v":4.7619047619047623E-3},150411.1999999999,5700.7]
[4,3,10,11,822.7,0,1932,1932,1,36303,2850,0,14484,3000,15260,2788,1526,7.3999999999999996E-2,0.9,0,null,null,null,"Dec",{"$f":"Y13+1/210","v":9.5238095238095247E-3},66565.300000000017,4695.3999999999996]
[4,3,10,12,822.7,0,1932,1932,1,35484,2850,0,14484,3000,13901,2788,1526,7.3999999999999996E-2,0.9,0,null,null,null,"Dec",{"$f":"Y14+1/210","v":1.4285714285714287E-2},43547.500000000029,4398.2]
[4,3,10,13,822.7,0,1932,1932,1,34755,2850,0,14484,3000,12486,2664,1526,7.3999999999999996E-2,0.86,0,null,null,null,"Dec",1.9047619047619049E-2,327,65.400000000000006]
[4,3,10,14,822.7,0,1932,1932,1,34119,2850,0,14484,3000,12097,2416,1526,7.3999999999999996E-2,0.78,0,null,null,null,"Dec",2.3809523809523812E-2,0,0]
[4,3,10,15,822.7,0,1932,1932,1,33784,2850,0,14484,3000,12196,1983,1526,7.3999999999999996E-2,0.64,0,null,null,null,"Jan",{"$f":"1/210","v":4.7619047619047623E-3},55426.700000000004,5613.9]
[4,3,10,16,822.7,0,1932,1932,1,34272,2850,0,14484,3000,13975,1518,1526,7.3999999999999996E-2,0.49,0,null,null,null,"Jan",{"$f":"Y18+1/210","v":9.5238095238095247E-3},7695.9000000000005,1885.8]
[4,3,10,17,822.7,0,1932,1932,1,36590,2850,0,14484,3000,17375,960,1526,7.3999999999999996E-2,0.31,0,null,null,null,"Jan",{"$f":"Y19+1/210","v":1.4285714285714287E-2},1831.9,949.6]
[4,3,10,18,822.7,0,1932,1932,1,38729,2850,0,14484,3000,19792,682,1526,7.3999999999999996E-2,0.22,0,null,null,null,"Jan",{"$f":"Y20+1/210","v":1.9047619047619049E-2},0,0]
[4,3,10,19,822.7,0,1932,1932,1,38519,2850,0,14484,3000,19830,434,1526,7.3999999999999996E-2,0.14000000000000001,0]
[4,3,10,20,822.7,0,1932,1932,1,37538,2850,0,14484,3000,19066,217,1526,7.3999999999999996E-2,7.0000000000000007E-2,0]
[4,3,10,21,822.7,0,1932,1932,1,36333,2850,0,14484,3000,17954,124,1526,7.3999999999999996E-2,0.04,0,null,null,null,"Energy","LOLP","EERD"]
[4,3,10,22,822.7,0,1932,1932,1,34504,2850,0,14484,3000,15617,93,1526,7.3999999999999996E-2,0.03,0,null,null,null,"Jan",0.8,1.9]
[4,3,10,23,4398.2,0,1932,1932,1,31758,2850,0,13866,3000,9545,124,2144,0.105,0.04,0,null,null,null,"Feb",0,0]
[4,3,10,24,3832.8,0,1932,1932,1,29187,2850,0,14431,3000,6880,217,1578,7.6999999999999999E-2,7.0000000000000007E-2,0,null,null,null,"Mar",0,0]
[4,3,11,1,2278.9,0,1932,1932,1,27274,2850,0,14444,3000,6293,434,1566,7.5999999999999998E-2,0.14000000000000001,0,null,null,null,"Apr",0,0]
[4,3,11,2,1130.0999999999999,0,1932,1932,1,26686,2850,0,14602,3000,6293,836,1408,6.9000000000000006E-2,0.27,0,null,null,null,"May ",0,0]
[4,3,11,3,189.6,0,1932,1932,1,26514,2850,0,14689,3000,6293,1518,1321,6.4000000000000001E-2,0.49,0,null,null,null,"Jun",0,0]
[4,3,11,4,214.7,0,1932,1932,1,26818,2850,0,14689,3000,6293,1797,1321,6.4000000000000001E-2,0.57999999999999996,0,null,null,null,"Jul",0,0]
[4,3,11,5,1317.9,0,1932,1932,1,27921,2850,0,14689,3000,6293,1797,1321,6.4000000000000001E-2,0.57999999999999996,0,null,null,null,"Aug",0.7,4.3]
[4,3,11,6,3282.5,0,1932,1932,1,30575,2850,0,14689,3000,6796,1983,1321,6.4000000000000001E-2,0.64,0,null,null,null,"Sep",0,0]
[4,3,11,7,324.8,0,1932,1932,1,34385,2850,0,14689,3000,14285,2138,1321,6.4000000000000001E-2,0.69,0,null,null,null,"Oct",0,0]
[4,3,11,8,324.8,0,1932,1932,1,36718,2850,0,14689,3000,16680,2076,1321,6.4000000000000001E-2,0.67,0,null,null,null,"Nov",0,0]
[4,3,11,9,324.8,0,1932,1932,1,37010,2850,0,14689,3000,16817,2231,1321,6.4000000000000001E-2,0.72,0,null,null,null,"Dec",1.6,2.4]
[4,3,11,10,324.8,0,1932,1932,1,36692,2850,0,14689,3000,16654,2076,1321,6.4000000000000001E-2,0.67,0]
[4,3,11,11,324.8,0,1932,1932,1,36111,2850,0,14689,3000,16135,2014,1321,6.4000000000000001E-2,0.65,0,null,null,null,"Peak","LOLP  ","EERD"]
[4,3,11,12,324.8,0,1932,1932,1,35297,2850,0,14689,3000,14751,2045,1321,6.4000000000000001E-2,0.66,0,null,null,null,"Jan",1.7,1.9]
[4,3,11,13,324.8,0,1932,1932,1,34591,2850,0,14689,3000,13172,2107,1321,6.4000000000000001E-2,0.68,0,null,null,null,"Feb",0,0]
[4,3,11,14,324.8,0,1932,1932,1,33982,2850,0,14689,3000,12625,2045,1321,6.4000000000000001E-2,0.66,0,"Dec",{"$f":"SUM(E4:E41)","v":43547.500000000029},{"$f":"MAX(E4:E41)","v":4398.2},"Mar",0,0]
[75,3,8,21,204.5,0,1932,1932,2,36055,2850,0,14575,3000,18203,124,1435,7.0000000000000007E-2,0.04,0,null,null,null,"Apr",0,0]
[75,3,8,22,1737.8,0,1932,1932,2,34268,2850,0,14575,3000,14312,155,1435,7.0000000000000007E-2,0.05,0,null,null,null,"May ",0,0]
[75,3,8,23,4695.3999999999996,0,1932,1932,2,31601,2850,0,14575,3000,8444,62,1435,7.0000000000000007E-2,0.02,0,null,null,null,"Jun",0,0]
[75,3,8,24,4248.3,0,1932,1932,2,29081,2850,0,14575,3000,6339,93,1435,7.0000000000000007E-2,0.03,0,null,null,null,"Jul",0,0]
[75,3,9,1,2789.2,0,1932,1932,2,27739,2850,0,14523,3000,6323,279,1487,7.1999999999999995E-2,0.09,0,null,null,null,"Aug",0,4.3]
[75,3,9,2,2049.1999999999998,0,1932,1932,2,27165,2850,0,14441,3000,6323,527,1569,7.5999999999999998E-2,0.17,0,null,null,null,"Sep",0,0]
[75,3,9,3,1643.3,0,1932,1932,2,26976,2850,0,14441,3000,6323,744,1569,7.5999999999999998E-2,0.24,0,null,null,null,"Oct",0,0]
[75,3,9,4,1803.4,0,1932,1932,2,27260,2850,0,14441,3000,6323,867,1569,7.5999999999999998E-2,0.28000000000000003,0,null,null,null,"Nov",0,0]
[75,3,9,5,2781.7,0,1932,1932,2,28300,2850,0,14441,3000,6323,929,1569,7.5999999999999998E-2,0.3,0,null,null,null,"Dec",1.8,2.4]
[75,3,9,6,4304.1000000000004,0,1932,1932,2,30794,2850,0,14441,3000,7666,558,1569,7.5999999999999998E-2,0.18,0]
[75,3,9,7,1346.4,0,1932,1932,2,34422,2850,0,14441,3000,15159,527,1569,7.5999999999999998E-2,0.17,0]
[75,3,9,8,1346.4,0,1932,1932,2,36816,2850,0,14441,3000,17429,651,1569,7.5999999999999998E-2,0.21,0]
[75,3,9,9,1346.4,0,1932,1932,2,37335,2850,0,14441,3000,17886,713,1569,7.5999999999999998E-2,0.23,0]
[75,3,9,10,1346.4,0,1932,1932,2,37149,2850,0,14441,3000,17731,682,1569,7.5999999999999998E-2,0.22,0]
[75,3,9,11,1346.4,0,1932,1932,2,36589,2850,0,14441,3000,17079,774,1569,7.5999999999999998E-2,0.25,0]
[75,3,9,12,1346.4,0,1932,1932,2,35755,2850,0,14441,3000,15612,867,1569,7.5999999999999998E-2,0.28000000000000003,0]
[75,3,9,13,1346.4,0,1932,1932,2,34998,2850,0,14441,3000,13921,991,1569,7.5999999999999998E-2,0.32,0]
[75,3,9,14,1346.4,0,1932,1932,2,34340,2850,0,14441,3000,13108,1146,1569,7.5999999999999998E-2,0.37,0]
[75,3,9,15,1346.4,0,1932,1932,2,33992,2850,0,14441,3000,12791,1115,1569,7.5999999999999998E-2,0.36,0]
{"$rows_left_out":325}